Build failed

Previous Topic Next Topic
 
classic Classic list List threaded Threaded
1 message Options
Reply | Threaded
Open this post in threaded view
|

Build failed

Dildar Sk
I tried,
$make install
And several errors came,like

Makefile:14823: recipe for target 'install-binPROGRAMS' failed
make[3]: *** [install-binPROGRAMS] Error 1
make[3]: Leaving directory '/home/dildar/Desktop/oct/octave/.build'
Makefile:26721: recipe for target 'install-am' failed
make[2]: *** [install-am] Error 2
make[2]: Leaving directory '/home/dildar/Desktop/oct/octave/.build'
Makefile:26415: recipe for target 'install-recursive' failed
make[1]: *** [install-recursive] Error 1
make[1]: Leaving directory '/home/dildar/Desktop/oct/octave/.build'
Makefile:26715: recipe for target 'install' failed
make: *** [install] Error 2




--
Sent from: http://octave.1599824.n4.nabble.com/Octave-Maintainers-f1638794.html


-----------------------------------------
Join us March 12-15 at CERN near Geneva
Switzerland for OctConf 2018.  More info:
https://wiki.octave.org/OctConf_2018
-----------------------------------------