./build-aux/mk-hg-id.sh: line 42: ./build-aux/move-if-change: No such file or directory

Previous Topic Next Topic
 
classic Classic list List threaded Threaded
3 messages Options
Reply | Threaded
Open this post in threaded view
|

./build-aux/mk-hg-id.sh: line 42: ./build-aux/move-if-change: No such file or directory

bpabbott
Administrator
Mike,

I’m seeing the error below

./build-aux/mk-hg-id.sh: line 42: ./build-aux/move-if-change: No such file or directory
  GEN      libinterp/dldfcn/module.mk
/bin/sh: ./build-aux/move-if-change: No such file or directory
make: *** [Makefile:27434: libinterp/dldfcn/module.mk] Error 127

Perhaps it is associated with your recent changeset?

        http://hg.savannah.gnu.org/hgweb/octave/rev/04e17bfe7a00

Ben


Reply | Threaded
Open this post in threaded view
|

Re: ./build-aux/mk-hg-id.sh: line 42: ./build-aux/move-if-change: No such file or directory

Mike Miller-4
On Sun, Sep 24, 2017 at 13:17:41 -0400, Ben Abbott wrote:

> Mike,
>
> I’m seeing the error below
>
> ./build-aux/mk-hg-id.sh: line 42: ./build-aux/move-if-change: No such file or directory
>   GEN      libinterp/dldfcn/module.mk
> /bin/sh: ./build-aux/move-if-change: No such file or directory
> make: *** [Makefile:27434: libinterp/dldfcn/module.mk] Error 127
>
> Perhaps it is associated with your recent changeset?
>
> http://hg.savannah.gnu.org/hgweb/octave/rev/04e17bfe7a00
Yeah, please try running ./bootstrap first to see if that solves it.

--
mike

signature.asc (849 bytes) Download Attachment
Reply | Threaded
Open this post in threaded view
|

Re: ./build-aux/mk-hg-id.sh: line 42: ./build-aux/move-if-change: No such file or directory

bpabbott
Administrator

> On Sep 24, 2017, at 1:20 PM, Mike Miller <[hidden email]> wrote:
>
> On Sun, Sep 24, 2017 at 13:17:41 -0400, Ben Abbott wrote:
>> Mike,
>>
>> I’m seeing the error below
>>
>> ./build-aux/mk-hg-id.sh: line 42: ./build-aux/move-if-change: No such file or directory
>>  GEN      libinterp/dldfcn/module.mk
>> /bin/sh: ./build-aux/move-if-change: No such file or directory
>> make: *** [Makefile:27434: libinterp/dldfcn/module.mk] Error 127
>>
>> Perhaps it is associated with your recent changeset?
>>
>> http://hg.savannah.gnu.org/hgweb/octave/rev/04e17bfe7a00
>
> Yeah, please try running ./bootstrap first to see if that solves it.
>
> --
> mike

Thanks Mike.
Ben