doc/interpreter/octave_interpreter.qch fails on ubnutu 16.04 in stable branch

Previous Topic Next Topic
 
classic Classic list List threaded Threaded
9 messages Options
Reply | Threaded
Open this post in threaded view
|

doc/interpreter/octave_interpreter.qch fails on ubnutu 16.04 in stable branch

tmacchant
I tried recent stable snapshot. (16155531bda4)


GEN      doc/interpreter/octave_interpreter.qch
qcollectiongenerator: could not exec '/usr/lib/x86_64-linux-gnu/qt4/bin/qcollectiongenerator': No such file or directory
Makefile:27894: recipe for target 'doc/interpreter/octave_interpreter.qch' failed
make[2]: *** [doc/interpreter/octave_interpreter.qch] Error 1
make[2]: Leaving directory '/home/mousei7/work/Octave/octave-hg/octave'
Makefile:26512: recipe for target 'all-recursive' failed
make[1]: *** [all-recursive] Error 1
make[1]: Leaving directory '/home/mousei7/work/Octave/octave-hg/octave'
Makefile:10167: recipe for target 'all' failed
make: *** [all] Error 2


I have configured with qt5.


Perhaps my setting qt on ubuntu 16.04 is wrong.

Any suggestions?


Reply | Threaded
Open this post in threaded view
|

Re: doc/interpreter/octave_interpreter.qch fails on ubnutu 16.04 in stable branch

tmacchant
----- Original Message -----

> From: Tatsuro MATSUOKA
> To: "[hidden email]"
> Cc:
> Date: 2018/3/20, Tue 10:11
> Subject: doc/interpreter/octave_interpreter.qch fails on ubnutu 16.04 in stable branch
>
> I tried recent stable snapshot. (16155531bda4)
>
>
> GEN      doc/interpreter/octave_interpreter.qch
> qcollectiongenerator: could not exec
> '/usr/lib/x86_64-linux-gnu/qt4/bin/qcollectiongenerator': No such file
> or directory
> Makefile:27894: recipe for target
> 'doc/interpreter/octave_interpreter.qch' failed
> make[2]: *** [doc/interpreter/octave_interpreter.qch] Error 1
> make[2]: Leaving directory '/home/mousei7/work/Octave/octave-hg/octave'
> Makefile:26512: recipe for target 'all-recursive' failed
> make[1]: *** [all-recursive] Error 1
> make[1]: Leaving directory '/home/mousei7/work/Octave/octave-hg/octave'
> Makefile:10167: recipe for target 'all' failed
> make: *** [all] Error 2
>
>
> I have configured with qt5.

This is not correct. I configure without any options for qt and qt5 is selected.

I reconfigured --with-qt=5 and trying to make again.

Tatsuro


>
> Perhaps my setting qt on ubuntu 16.04 is wrong.
>
> Any suggestions?
>



Reply | Threaded
Open this post in threaded view
|

Re: doc/interpreter/octave_interpreter.qch fails on ubnutu 16.04 in stable branch

tmacchant
----- Original Message -----

> From: Tatsuro MATSUOKA
> To: tmacchant "help-octave
> Cc:
> Date: 2018/3/20, Tue 10:20
> Subject: Re: doc/interpreter/octave_interpreter.qch fails on ubnutu 16.04 in stable branch
>
> ----- Original Message -----
>>
>>  I tried recent stable snapshot. (16155531bda4)
>>
>>
>>  GEN      doc/interpreter/octave_interpreter.qch
>>  qcollectiongenerator: could not exec
>>  '/usr/lib/x86_64-linux-gnu/qt4/bin/qcollectiongenerator': No such
> file
>>  or directory
>>  Makefile:27894: recipe for target
>>  'doc/interpreter/octave_interpreter.qch' failed
>>  make[2]: *** [doc/interpreter/octave_interpreter.qch] Error 1
>>  make[2]: Leaving directory
> '/home/mousei7/work/Octave/octave-hg/octave'
>>  Makefile:26512: recipe for target 'all-recursive' failed
>>  make[1]: *** [all-recursive] Error 1
>>  make[1]: Leaving directory
> '/home/mousei7/work/Octave/octave-hg/octave'
>>  Makefile:10167: recipe for target 'all' failed
>>  make: *** [all] Error 2
>>
>>
>>  I have configured with qt5.
>
> This is not correct. I configure without any options for qt and qt5 is selected.
>
> I reconfigured --with-qt=5 and trying to make again.
>
> Tatsuro
>
make still see qt4 qcollectiongenerator


$ locate qcollectiongenerator
/usr/bin/qcollectiongenerator
/usr/lib/x86_64-linux-gnu/qt5/bin/qcollectiongenerator

It smells bug in configure?

Tatsuro


Reply | Threaded
Open this post in threaded view
|

/usr/bin/texi2dvi: etex exited with bad status, quitting. in make stable branch(was Re: doc/interpreter/octave_interpreter.qch fails ...)

tmacchant




----- Original Message -----
> From: Tatsuro MATSUOKA
> To: tmacchant "help-octave@
> Date: 2018/3/20, Tue 10:24
> Subject: Re: doc/interpreter/octave_interpreter.qch fails on ubnutu 16.04 in stable branch

>>  ----- Original Message -----
>>>
>>>   I tried recent stable snapshot. (16155531bda4)
>>>
>>>
>>>   GEN      doc/interpreter/octave_interpreter.qch
>>>   qcollectiongenerator: could not exec
>>>   '/usr/lib/x86_64-linux-gnu/qt4/bin/qcollectiongenerator': No
> such
>>  file
>>>   or directory
>>>   Makefile:27894: recipe for target
>>>   'doc/interpreter/octave_interpreter.qch' failed
>>>   make[2]: *** [doc/interpreter/octave_interpreter.qch] Error 1
>>>   make[2]: Leaving directory
>>  '/home/mousei7/work/Octave/octave-hg/octave'
>>>   Makefile:26512: recipe for target 'all-recursive' failed
>>>   make[1]: *** [all-recursive] Error 1
>>>   make[1]: Leaving directory
>>  '/home/mousei7/work/Octave/octave-hg/octave'
>>>   Makefile:10167: recipe for target 'all' failed
>>>   make: *** [all] Error 2
>>>
>>>
>>>   I have configured with qt5.
>>
>>  This is not correct. I configure without any options for qt and qt5 is
> selected.
>>
>>  I reconfigured --with-qt=5 and trying to make again.
>>
>>  Tatsuro
>>
> make still see qt4 qcollectiongenerator
>
>
> $ locate qcollectiongenerator
> /usr/bin/qcollectiongenerator
> /usr/lib/x86_64-linux-gnu/qt5/bin/qcollectiongenerator
>
> It smells bug in configure?

I execute dirty workaround

sudo ln -s /usr/lib/x86_64-linux-gnu/qt5/bin/qcollectiongenerator /usr/lib/x86_64-linux-gnu/qt4/bin/qcollectiongenerator

The above is passed but I h

  GEN      doc/interpreter/octave_interpreter.qhc
/usr/bin/texi2dvi: etex exited with bad status, quitting.

Any suggestions?

Tatsuro


Reply | Threaded
Open this post in threaded view
|

Re: doc/interpreter/octave_interpreter.qch fails on ubnutu 16.04 in stable branch

Mike Miller-4
In reply to this post by tmacchant
On Tue, Mar 20, 2018 at 10:24:04 +0900, Tatsuro MATSUOKA wrote:
> make still see qt4 qcollectiongenerator
>
>
> $ locate qcollectiongenerator
> /usr/bin/qcollectiongenerator
> /usr/lib/x86_64-linux-gnu/qt5/bin/qcollectiongenerator
>
> It smells bug in configure?

Yes, I think so.

This looks very similar to

  https://lists.gnu.org/archive/html/octave-maintainers/2018-03/msg00098.html

I think you have both Qt 4 and Qt 5 installed correctly, Qt 4 configured
as the system default, and Octave's configure is not passing the right
options.

--
mike



signature.asc (849 bytes) Download Attachment
Reply | Threaded
Open this post in threaded view
|

Re: /usr/bin/texi2dvi: etex exited with bad status, quitting. in make stable branch(was Re: doc/interpreter/octave_interpreter.qch fails ...)

Dmitri A. Sergatskov
In reply to this post by tmacchant
On Mon, Mar 19, 2018 at 8:38 PM, Tatsuro MATSUOKA <[hidden email]> wrote:




----- Original Message -----
> From: Tatsuro MATSUOKA
> To: tmacchant "help-octave@
> Date: 2018/3/20, Tue 10:24
> Subject: Re: doc/interpreter/octave_interpreter.qch fails on ubnutu 16.04 in stable branch

>>  ----- Original Message -----
>>>
>>>   I tried recent stable snapshot. (16155531bda4)
>>>
>>>
>>>   GEN      doc/interpreter/octave_interpreter.qch
>>>   qcollectiongenerator: could not exec
>>>   '/usr/lib/x86_64-linux-gnu/qt4/bin/qcollectiongenerator': No
> such
>>  file
>>>   or directory
>>>   Makefile:27894: recipe for target
>>>   'doc/interpreter/octave_interpreter.qch' failed
>>>   make[2]: *** [doc/interpreter/octave_interpreter.qch] Error 1
>>>   make[2]: Leaving directory
>>  '/home/mousei7/work/Octave/octave-hg/octave'
>>>   Makefile:26512: recipe for target 'all-recursive' failed
>>>   make[1]: *** [all-recursive] Error 1
>>>   make[1]: Leaving directory
>>  '/home/mousei7/work/Octave/octave-hg/octave'
>>>   Makefile:10167: recipe for target 'all' failed
>>>   make: *** [all] Error 2
>>>
>>>
>>>   I have configured with qt5.
>>
>>  This is not correct. I configure without any options for qt and qt5 is
> selected.
>>
>>  I reconfigured --with-qt=5 and trying to make again.
>>
>>  Tatsuro
>>
> make still see qt4 qcollectiongenerator
>
>
> $ locate qcollectiongenerator
> /usr/bin/qcollectiongenerator
> /usr/lib/x86_64-linux-gnu/qt5/bin/qcollectiongenerator
>
> It smells bug in configure?

I execute dirty workaround

sudo ln -s /usr/lib/x86_64-linux-gnu/qt5/bin/qcollectiongenerator /usr/lib/x86_64-linux-gnu/qt4/bin/qcollectiongenerator

The above is passed but I h

  GEN      doc/interpreter/octave_interpreter.qhc
/usr/bin/texi2dvi: etex exited with bad status, quitting.

Any suggestions?

Tatsuro



​Try "make V=1​
​".
Do not run parallel make (do not pass any "-j" options).

Dmitri.
--
 



Reply | Threaded
Open this post in threaded view
|

Re: /usr/bin/texi2dvi: etex exited with bad status, quitting. in make stable branch(was Re: doc/interpreter/octave_interpreter.qch fails ...)

tmacchant
----- Original Message -----

>From: Dmitri A. Sergatskov
>To: Tatsuro MATSUOKA
>Cc: "help-octave
>Date: 2018/3/20, Tue 11:04
>Subject: Re: /usr/bin/texi2dvi: etex exited with bad status, quitting. in make stable branch(was Re: doc/interpreter/octave_interpreter.qch fails ...)
>
>>>>  ----- Original Message -----
>>>>>
>>>>>   I tried recent stable snapshot. (16155531bda4)
>>>>>
>>>>>
>>>>>   GEN      doc/interpreter/octave_ interpreter.qch
>>>>>   qcollectiongenerator: could not exec
>>>>>   '/usr/lib/x86_64-linux-gnu/ qt4/bin/qcollectiongenerator': No
>>> such
>>>>  file
>>>>>   or directory
>>>>>   Makefile:27894: recipe for target
>>>>>   'doc/interpreter/octave_ interpreter.qch' failed
>>>>>   make[2]: *** [doc/interpreter/octave_ interpreter.qch] Error 1
>>>>>   make[2]: Leaving directory
>>>>  '/home/mousei7/work/Octave/ octave-hg/octave'
>>>>>   Makefile:26512: recipe for target 'all-recursive' failed
>>>>>   make[1]: *** [all-recursive] Error 1
>>>>>   make[1]: Leaving directory
>>>>  '/home/mousei7/work/Octave/ octave-hg/octave'
>>>>>   Makefile:10167: recipe for target 'all' failed
>>>>>   make: *** [all] Error 2
>>>>>
>>>>>
>>>>>   I have configured with qt5.
>>>>
>>>>  This is not correct. I configure without any options for qt and qt5 is
>>> selected.
>>>>
>>>>  I reconfigured --with-qt=5 and trying to make again.
>>>>
>>>>  Tatsuro
>>>>
>>> make still see qt4 qcollectiongenerator
>>>
>>>
>>> $ locate qcollectiongenerator
>>> /usr/bin/qcollectiongenerator
>>> /usr/lib/x86_64-linux-gnu/qt5/ bin/qcollectiongenerator
>>>
>>> It smells bug in configure?
>>
>>I execute dirty workaround
>>
>>sudo ln -s /usr/lib/x86_64-linux-gnu/qt5/ bin/qcollectiongenerator /usr/lib/x86_64-linux-gnu/qt4/ bin/qcollectiongenerator
>>
>>The above is passed but I h
>>
>>  GEN      doc/interpreter/octave_ interpreter.qhc
>>/usr/bin/texi2dvi: etex exited with bad status, quitting.
>>
>>Any suggestions?
>>
>>Tatsuro
>>
>>
>>
>
>​Try "make V=1​​".
>Do not run parallel make (do not pass any "-j" options).
>
>Dmitri.


Worked! Thanks!

I can execute make dist.

Tatsuro



Reply | Threaded
Open this post in threaded view
|

Re: doc/interpreter/octave_interpreter.qch fails on ubnutu 16.04 in stable branch

Mike Miller-4
In reply to this post by tmacchant
On Tue, Mar 20, 2018 at 10:24:04 +0900, Tatsuro MATSUOKA wrote:
> make still see qt4 qcollectiongenerator
>
>
> $ locate qcollectiongenerator
> /usr/bin/qcollectiongenerator
> /usr/lib/x86_64-linux-gnu/qt5/bin/qcollectiongenerator
>
> It smells bug in configure?

This should be fixed now on the stable branch

  https://hg.savannah.gnu.org/hgweb/octave/rev/4f1da669b610

--
mike



signature.asc (849 bytes) Download Attachment
Reply | Threaded
Open this post in threaded view
|

Re: doc/interpreter/octave_interpreter.qch fails on ubnutu 16.04 in stable branch

tmacchant
----- Original Message -----

> From: Mike Miller
> To: help-octave
> Cc:
> Date: 2018/3/20, Tue 12:58
> Subject: Re: doc/interpreter/octave_interpreter.qch fails on ubnutu 16.04 in stable branch
>
> On Tue, Mar 20, 2018 at 10:24:04 +0900, Tatsuro MATSUOKA wrote:
>>  make still see qt4 qcollectiongenerator
>>
>>
>>  $ locate qcollectiongenerator
>>  /usr/bin/qcollectiongenerator
>>  /usr/lib/x86_64-linux-gnu/qt5/bin/qcollectiongenerator
>>
>>  It smells bug in configure?
>
> This should be fixed now on the stable branch
>
>   https://hg.savannah.gnu.org/hgweb/octave/rev/4f1da669b610
>
> --
> mike
I have confirmed the fix. Thanks.

Tatsuro