macOS 4.4.0 DMG (beta2) ready for testing

Previous Topic Next Topic
 
classic Classic list List threaded Threaded
16 messages Options
Reply | Threaded
Open this post in threaded view
|

macOS 4.4.0 DMG (beta2) ready for testing

AndrewJanke
Hi, Octave Maintainers and Mac-interested Octave folks,

I have joined Sebastian Schoeps in putting together a Mac binary package
of Octave. We have a "beta 2" release that is almost ready for prime time.

If you are interested, would you mind downloading and testing it out?

https://github.com/octave-app/octave-app/releases/download/untagged-4e9d0ab25492be932368/Octave-4.4.0-beta2.dmg

All beta releases will be available at:
http://octave-app.org/Developer-Downloads.html

Source code used to produce this app bundle can be found at:
https://github.com/octave-app/octave-app-bundler

Since this is an unsigned app, the first time you run it, you will need
to right-click it and choose "Open" instead of just double-clicking it,
so you get a dialog with the option to run it even though it's from an
unidentified developer. We're looking at fixing this.

Cheers,
Andrew Janke



Reply | Threaded
Open this post in threaded view
|

Re: macOS 4.4.0 DMG (beta2) ready for testing

Simone Deparis
Hi Andrew,

Thanks! I have done little basic tests and I did not find any problems.
(Those tests were failing in older versions of the Mac binary).

Using High Sierra 10.13.5 (17F77)

Best regards
Simone

On 26.06.18 22:11, Andrew Janke wrote:

> Hi, Octave Maintainers and Mac-interested Octave folks,
>
> I have joined Sebastian Schoeps in putting together a Mac binary package
> of Octave. We have a "beta 2" release that is almost ready for prime time.
>
> If you are interested, would you mind downloading and testing it out?
>
> https://github.com/octave-app/octave-app/releases/download/untagged-4e9d0ab25492be932368/Octave-4.4.0-beta2.dmg 
>
>
> All beta releases will be available at:
> http://octave-app.org/Developer-Downloads.html
>
> Source code used to produce this app bundle can be found at:
> https://github.com/octave-app/octave-app-bundler
>
> Since this is an unsigned app, the first time you run it, you will need
> to right-click it and choose "Open" instead of just double-clicking it,
> so you get a dialog with the option to run it even though it's from an
> unidentified developer. We're looking at fixing this.
>
> Cheers,
> Andrew Janke
>
>

--
_____________________________________________________________________

   Simone Deparis, PhD, MER
   Deputy Director SMA
   MA A2 383
   SMA - SB - EPFL
   Station 8
   CH - 1015 Lausanne
   Switzerland

   phone :  +41 -21 693 2547             mailto:[hidden email]
                                  http://people.epfl.ch/simone.deparis
_____________________________________________________________________

Reply | Threaded
Open this post in threaded view
|

Re: macOS 4.4.0 DMG (beta2) ready for testing

AndrewJanke
Great. Thank you for testing, Simone!

Cheers,
Andrew

On 6/27/18 11:21 AM, Simone Deparis wrote:

> Hi Andrew,
>
> Thanks! I have done little basic tests and I did not find any problems.
> (Those tests were failing in older versions of the Mac binary).
>
> Using High Sierra 10.13.5 (17F77)
>
> Best regards
> Simone
>
> On 26.06.18 22:11, Andrew Janke wrote:
>> Hi, Octave Maintainers and Mac-interested Octave folks,
>>
>> I have joined Sebastian Schoeps in putting together a Mac binary
>> package of Octave. We have a "beta 2" release that is almost ready
>> for prime time.
>>
>> If you are interested, would you mind downloading and testing it out?
>>
>> https://github.com/octave-app/octave-app/releases/download/untagged-4e9d0ab25492be932368/Octave-4.4.0-beta2.dmg 
>>
>>
>> All beta releases will be available at:
>> http://octave-app.org/Developer-Downloads.html
>>
>> Source code used to produce this app bundle can be found at:
>> https://github.com/octave-app/octave-app-bundler
>>
>> Since this is an unsigned app, the first time you run it, you will
>> need to right-click it and choose "Open" instead of just
>> double-clicking it, so you get a dialog with the option to run it
>> even though it's from an unidentified developer. We're looking at
>> fixing this.
>>
>> Cheers,
>> Andrew Janke
>>
>>
>


Reply | Threaded
Open this post in threaded view
|

Re: macOS 4.4.0 DMG (beta2) ready for testing

elmusrati
In reply to this post by AndrewJanke
Hello,

It is really an important update. This is the first (DMG) version after Octave-4.0.3 that started-up successfully on my Macbook Pro 15 with macOS High Sierra 10.13.5. However, there are some (few so far) problems, for example, when I load control package and run function tf(a,b) the whole Octave crash and closed. Every time I try to run function (tf) it crashes.

Thank you

Mohammed
 
---------------------------------------
Mohammed Elmusrati, Full Professor
Head of Communications and Systems Eng. Group
Faculty of Technology
University of Vaasa




> On 26 Jun 2018, at 23:11, Andrew Janke <[hidden email]> wrote:
>
> Hi, Octave Maintainers and Mac-interested Octave folks,
>
> I have joined Sebastian Schoeps in putting together a Mac binary package of Octave. We have a "beta 2" release that is almost ready for prime time.
>
> If you are interested, would you mind downloading and testing it out?
>
> https://github.com/octave-app/octave-app/releases/download/untagged-4e9d0ab25492be932368/Octave-4.4.0-beta2.dmg
>
> All beta releases will be available at: http://octave-app.org/Developer-Downloads.html
>
> Source code used to produce this app bundle can be found at: https://github.com/octave-app/octave-app-bundler
>
> Since this is an unsigned app, the first time you run it, you will need to right-click it and choose "Open" instead of just double-clicking it, so you get a dialog with the option to run it even though it's from an unidentified developer. We're looking at fixing this.
>
> Cheers,
> Andrew Janke
>
>
>


Reply | Threaded
Open this post in threaded view
|

Re: macOS 4.4.0 DMG (beta2) ready for testing

AndrewJanke
Good; I hope it is useful to you.

I'm afraid I am unable to reproduce the crash. I installed control using
`pkg install -forge control`, loaded it with `pkg load control`, and
tried out the example functions found in `help tf`, and they worked.

 >> s = tf ('s');
 >> G = 1/(s+1)

Transfer function 'G' from input 'u1' to output ...

         1
  y1:  -----
       s + 1

Continuous-time model.
 >> num = {[1, 5, 7], [1]; [1, 7], [1, 5, 5]};
 >> den = {[1, 5, 6], [1, 2]; [1, 8, 6], [1, 3, 2]};
 >> sys = tf (num, den)

Transfer function 'sys' from input 'u1' to output ...

       s^2 + 5 s + 7
  y1:  -------------
       s^2 + 5 s + 6

           s + 7
  y2:  -------------
       s^2 + 8 s + 6

Transfer function 'sys' from input 'u2' to output ...

         1
  y1:  -----
       s + 2

       s^2 + 5 s + 5
  y2:  -------------
       s^2 + 3 s + 2

Continuous-time model.
 >>


Though I did get a *ton* of compiler warnings when doing the `pkg
install -forge control` step.

Could you provide more specific steps to reproduce the crash? What
inputs are you using for "a" and "b" in "tf(a,b)"? And have you
re-installed the `control` package since upgrading to Octave 4.4.0?

I've opened an issue on the Octave.app project if you want to track my
progress on this: https://github.com/octave-app/octave-app-bundler/issues/37

Cheers,
Andrew


On 6/29/18 8:47 AM, Mohammed Elmusrati wrote:

> Hello,
>
> It is really an important update. This is the first (DMG) version after Octave-4.0.3 that started-up successfully on my Macbook Pro 15 with macOS High Sierra 10.13.5. However, there are some (few so far) problems, for example, when I load control package and run function tf(a,b) the whole Octave crash and closed. Every time I try to run function (tf) it crashes.
>
> Thank you
>
> Mohammed
>  
> ---------------------------------------
> Mohammed Elmusrati, Full Professor
> Head of Communications and Systems Eng. Group
> Faculty of Technology
> University of Vaasa
>
>
>
>
>> On 26 Jun 2018, at 23:11, Andrew Janke <[hidden email]> wrote:
>>
>> Hi, Octave Maintainers and Mac-interested Octave folks,
>>
>> I have joined Sebastian Schoeps in putting together a Mac binary package of Octave. We have a "beta 2" release that is almost ready for prime time.
>>
>> If you are interested, would you mind downloading and testing it out?
>>
>> https://github.com/octave-app/octave-app/releases/download/untagged-4e9d0ab25492be932368/Octave-4.4.0-beta2.dmg
>>
>> All beta releases will be available at: http://octave-app.org/Developer-Downloads.html
>>
>> Source code used to produce this app bundle can be found at: https://github.com/octave-app/octave-app-bundler
>>
>> Since this is an unsigned app, the first time you run it, you will need to right-click it and choose "Open" instead of just double-clicking it, so you get a dialog with the option to run it even though it's from an unidentified developer. We're looking at fixing this.
>>
>> Cheers,
>> Andrew Janke
>>
>>
>>


Reply | Threaded
Open this post in threaded view
|

Re: macOS 4.4.0 DMG (beta2) ready for testing

bpabbott
Administrator
In reply to this post by elmusrati


> On Jun 29, 2018, at 5:47 AM, Mohammed Elmusrati <[hidden email]> wrote:
>
> Hello,
>
> It is really an important update. This is the first (DMG) version after Octave-4.0.3 that started-up successfully on my Macbook Pro 15 with macOS High Sierra 10.13.5. However, there are some (few so far) problems, for example, when I load control package and run function tf(a,b) the whole Octave crash and closed. Every time I try to run function (tf) it crashes.
>
> Thank you
>
> Mohammed

Perhaps you tried to load the control package from your 4.0.3 version fo Octave?

Ben
Reply | Threaded
Open this post in threaded view
|

Re: macOS 4.4.0 DMG (beta2) ready for testing

elmusrati
Thank you for your kind help. Yes, you are right, I was using old packages from 4.0.3 version.  Hence, I wanted to re-install the control package, but unfortunately  it did not. I receive tons of warnings and finally an error message as

“pkg: error running `make' for the control package.
error: called from
    configure_make at line 95 column 9
    install at line 184 column 7
    pkg at line 437 column 9”

I have installed octave4.4 also using brew (over terminal). Do I need to remove it?

Thank you

Mohammed


---------------------------------------
Mohammed Elmusrati, Full Professor
Head of Communications and Systems Eng. Group
Faculty of Technology
University of Vaasa
Visiting Professor at Aalto University
Phone: +358 50 4003763
Website: www.uwasa.fi/~moel



> On 29 Jun 2018, at 17:30, Ben Abbott <[hidden email]> wrote:
>
>
>
>> On Jun 29, 2018, at 5:47 AM, Mohammed Elmusrati <[hidden email]> wrote:
>>
>> Hello,
>>
>> It is really an important update. This is the first (DMG) version after Octave-4.0.3 that started-up successfully on my Macbook Pro 15 with macOS High Sierra 10.13.5. However, there are some (few so far) problems, for example, when I load control package and run function tf(a,b) the whole Octave crash and closed. Every time I try to run function (tf) it crashes.
>>
>> Thank you
>>
>> Mohammed
>
> Perhaps you tried to load the control package from your 4.0.3 version fo Octave?
>
> Ben


Reply | Threaded
Open this post in threaded view
|

Re: macOS 4.4.0 DMG (beta2) ready for testing

Sebastian Schöps
elmusrati wrote
> “pkg: error running `make' for the control package.
> error: called from
>     configure_make at line 95 column 9
>     install at line 184 column 7
>     pkg at line 437 column 9”

I just tried to install the control package and it worked fine (Octave.app
beta3, macOS 10.13.5). You can check where make breaks by 'pkg install
-verbose -forge control' and report here what causes the problem.


elmusrati wrote
> I have installed octave4.4 also using brew (over terminal). Do I need to
> remove it?

No, that should be independent.



--
Sent from: http://octave.1599824.n4.nabble.com/Octave-Maintainers-f1638794.html

Reply | Threaded
Open this post in threaded view
|

Problem in control pkg installation!

elmusrati
Hello,

I have just installed (beta4).  Still I have a problem to install the control pkg. This is the whole error message I received:
"
pkg install -forge control
<built-in>: internal compiler error: Illegal instruction: 4
libbacktrace could not find executable to open
Please submit a full bug report,
with preprocessed source if appropriate.
See <https://github.com/Homebrew/homebrew-core/issues> for instructions.
make: *** [slicotlibrary.a] Error 1
make: *** Waiting for unfinished jobs....
In file included from __control_helper_functions__.cc:1:
./is_real_scalar.cc:52:30: warning: 'is_numeric_type' is deprecated
      [-Wdeprecated-declarations]
                || ! args(i).is_numeric_type () || ! args(i)....
                             ^
/Applications/Octave-4.4.0.app/Contents/Resources/usr/Cellar/octave-octave-app_4.4.0/4.4.0/include/octave-4.4.0/octave/ov.h:726:3: note:
      'is_numeric_type' has been explicitly marked deprecated here
  OCTAVE_DEPRECATED (4.4, "use 'isnumeric' instead")
  ^
/Applications/Octave-4.4.0.app/Contents/Resources/usr/Cellar/octave-octave-app_4.4.0/4.4.0/include/octave-4.4.0/octave/octave-config.h:73:59: note:
      expanded from macro 'OCTAVE_DEPRECATED'
#      define OCTAVE_DEPRECATED(ver, msg) __attribute__ ((__deprecat...
                                                          ^
In file included from __control_helper_functions__.cc:1:
./is_real_scalar.cc:52:62: warning: 'is_real_type' is deprecated
      [-Wdeprecated-declarations]
  ...|| ! args(i).is_numeric_type () || ! args(i).is_real_type ()
                                                  ^
/Applications/Octave-4.4.0.app/Contents/Resources/usr/Cellar/octave-octave-app_4.4.0/4.4.0/include/octave-4.4.0/octave/ov.h:706:3: note:
      'is_real_type' has been explicitly marked deprecated here
  OCTAVE_DEPRECATED (4.4, "use 'isreal' instead")
  ^
/Applications/Octave-4.4.0.app/Contents/Resources/usr/Cellar/octave-octave-app_4.4.0/4.4.0/include/octave-4.4.0/octave/octave-config.h:73:59: note:
      expanded from macro 'OCTAVE_DEPRECATED'
#      define OCTAVE_DEPRECATED(ver, msg) __attribute__ ((__deprecat...
                                                          ^
In file included from __control_helper_functions__.cc:2:
./is_real_vector.cc:52:30: warning: 'is_numeric_type' is deprecated
      [-Wdeprecated-declarations]
                || ! args(i).is_numeric_type () || ! args(i)....
                             ^
/Applications/Octave-4.4.0.app/Contents/Resources/usr/Cellar/octave-octave-app_4.4.0/4.4.0/include/octave-4.4.0/octave/ov.h:726:3: note:
      'is_numeric_type' has been explicitly marked deprecated here
  OCTAVE_DEPRECATED (4.4, "use 'isnumeric' instead")
  ^
/Applications/Octave-4.4.0.app/Contents/Resources/usr/Cellar/octave-octave-app_4.4.0/4.4.0/include/octave-4.4.0/octave/octave-config.h:73:59: note:
      expanded from macro 'OCTAVE_DEPRECATED'
#      define OCTAVE_DEPRECATED(ver, msg) __attribute__ ((__deprecat...
                                                          ^
In file included from __control_helper_functions__.cc:2:
./is_real_vector.cc:52:62: warning: 'is_real_type' is deprecated
      [-Wdeprecated-declarations]
  ...|| ! args(i).is_numeric_type () || ! args(i).is_real_type ()
                                                  ^
/Applications/Octave-4.4.0.app/Contents/Resources/usr/Cellar/octave-octave-app_4.4.0/4.4.0/include/octave-4.4.0/octave/ov.h:706:3: note:
      'is_real_type' has been explicitly marked deprecated here
  OCTAVE_DEPRECATED (4.4, "use 'isreal' instead")
  ^
/Applications/Octave-4.4.0.app/Contents/Resources/usr/Cellar/octave-octave-app_4.4.0/4.4.0/include/octave-4.4.0/octave/octave-config.h:73:59: note:
      expanded from macro 'OCTAVE_DEPRECATED'
#      define OCTAVE_DEPRECATED(ver, msg) __attribute__ ((__deprecat...
                                                          ^
In file included from __control_helper_functions__.cc:3:
./is_real_matrix.cc:51:52: warning: 'is_numeric_type' is deprecated
      [-Wdeprecated-declarations]
            if (args(i).ndims () != 2 || ! args(i).is_numeric_type ()
                                                   ^
/Applications/Octave-4.4.0.app/Contents/Resources/usr/Cellar/octave-octave-app_4.4.0/4.4.0/include/octave-4.4.0/octave/ov.h:726:3: note:
      'is_numeric_type' has been explicitly marked deprecated here
  OCTAVE_DEPRECATED (4.4, "use 'isnumeric' instead")
  ^
/Applications/Octave-4.4.0.app/Contents/Resources/usr/Cellar/octave-octave-app_4.4.0/4.4.0/include/octave-4.4.0/octave/octave-config.h:73:59: note:
      expanded from macro 'OCTAVE_DEPRECATED'
#      define OCTAVE_DEPRECATED(ver, msg) __attribute__ ((__deprecat...
                                                          ^
In file included from __control_helper_functions__.cc:3:
./is_real_matrix.cc:52:30: warning: 'is_real_type' is deprecated
      [-Wdeprecated-declarations]
                || ! args(i).is_real_type ()
                             ^
/Applications/Octave-4.4.0.app/Contents/Resources/usr/Cellar/octave-octave-app_4.4.0/4.4.0/include/octave-4.4.0/octave/ov.h:706:3: note:
      'is_real_type' has been explicitly marked deprecated here
  OCTAVE_DEPRECATED (4.4, "use 'isreal' instead")
  ^
/Applications/Octave-4.4.0.app/Contents/Resources/usr/Cellar/octave-octave-app_4.4.0/4.4.0/include/octave-4.4.0/octave/octave-config.h:73:59: note:
      expanded from macro 'OCTAVE_DEPRECATED'
#      define OCTAVE_DEPRECATED(ver, msg) __attribute__ ((__deprecat...
                                                          ^
In file included from __control_helper_functions__.cc:4:
./is_real_square_matrix.cc:52:30: warning: 'is_numeric_type' is
      deprecated [-Wdeprecated-declarations]
                || ! args(i).is_numeric_type () || ! args(i)....
                             ^
/Applications/Octave-4.4.0.app/Contents/Resources/usr/Cellar/octave-octave-app_4.4.0/4.4.0/include/octave-4.4.0/octave/ov.h:726:3: note:
      'is_numeric_type' has been explicitly marked deprecated here
  OCTAVE_DEPRECATED (4.4, "use 'isnumeric' instead")
  ^
/Applications/Octave-4.4.0.app/Contents/Resources/usr/Cellar/octave-octave-app_4.4.0/4.4.0/include/octave-4.4.0/octave/octave-config.h:73:59: note:
      expanded from macro 'OCTAVE_DEPRECATED'
#      define OCTAVE_DEPRECATED(ver, msg) __attribute__ ((__deprecat...
                                                          ^
In file included from __control_helper_functions__.cc:4:
./is_real_square_matrix.cc:52:62: warning: 'is_real_type' is
      deprecated [-Wdeprecated-declarations]
  ...|| ! args(i).is_numeric_type () || ! args(i).is_real_type ()
                                                  ^
/Applications/Octave-4.4.0.app/Contents/Resources/usr/Cellar/octave-octave-app_4.4.0/4.4.0/include/octave-4.4.0/octave/ov.h:706:3: note:
      'is_real_type' has been explicitly marked deprecated here
  OCTAVE_DEPRECATED (4.4, "use 'isreal' instead")
  ^
/Applications/Octave-4.4.0.app/Contents/Resources/usr/Cellar/octave-octave-app_4.4.0/4.4.0/include/octave-4.4.0/octave/octave-config.h:73:59: note:
      expanded from macro 'OCTAVE_DEPRECATED'
#      define OCTAVE_DEPRECATED(ver, msg) __attribute__ ((__deprecat...
                                                          ^
In file included from __control_helper_functions__.cc:5:
./is_matrix.cc:51:52: warning: 'is_numeric_type' is deprecated
      [-Wdeprecated-declarations]
            if (args(i).ndims () != 2 || ! args(i).is_numeric_type ()
                                                   ^
/Applications/Octave-4.4.0.app/Contents/Resources/usr/Cellar/octave-octave-app_4.4.0/4.4.0/include/octave-4.4.0/octave/ov.h:726:3: note:
      'is_numeric_type' has been explicitly marked deprecated here
  OCTAVE_DEPRECATED (4.4, "use 'isnumeric' instead")
  ^
/Applications/Octave-4.4.0.app/Contents/Resources/usr/Cellar/octave-octave-app_4.4.0/4.4.0/include/octave-4.4.0/octave/octave-config.h:73:59: note:
      expanded from macro 'OCTAVE_DEPRECATED'
#      define OCTAVE_DEPRECATED(ver, msg) __attribute__ ((__deprecat...
                                                          ^
In file included from __control_helper_functions__.cc:5:
./is_matrix.cc:52:31: warning: 'is_complex_type' is deprecated
      [-Wdeprecated-declarations]
                || ! (args(i).is_complex_type () || args(i).i...
                              ^
/Applications/Octave-4.4.0.app/Contents/Resources/usr/Cellar/octave-octave-app_4.4.0/4.4.0/include/octave-4.4.0/octave/ov.h:713:3: note:
      'is_complex_type' has been explicitly marked deprecated here
  OCTAVE_DEPRECATED (4.4, "use 'iscomplex' instead")
  ^
/Applications/Octave-4.4.0.app/Contents/Resources/usr/Cellar/octave-octave-app_4.4.0/4.4.0/include/octave-4.4.0/octave/octave-config.h:73:59: note:
      expanded from macro 'OCTAVE_DEPRECATED'
#      define OCTAVE_DEPRECATED(ver, msg) __attribute__ ((__deprecat...
                                                          ^
In file included from __control_helper_functions__.cc:5:
./is_matrix.cc:52:61: warning: 'is_real_type' is deprecated
      [-Wdeprecated-declarations]
  ...|| ! (args(i).is_complex_type () || args(i).is_real_type ())
                                                 ^
/Applications/Octave-4.4.0.app/Contents/Resources/usr/Cellar/octave-octave-app_4.4.0/4.4.0/include/octave-4.4.0/octave/ov.h:706:3: note:
      'is_real_type' has been explicitly marked deprecated here
  OCTAVE_DEPRECATED (4.4, "use 'isreal' instead")
  ^
/Applications/Octave-4.4.0.app/Contents/Resources/usr/Cellar/octave-octave-app_4.4.0/4.4.0/include/octave-4.4.0/octave/octave-config.h:73:59: note:
      expanded from macro 'OCTAVE_DEPRECATED'
#      define OCTAVE_DEPRECATED(ver, msg) __attribute__ ((__deprecat...
                                                          ^
In file included from __control_helper_functions__.cc:6:
./is_zp_vector.cc:53:30: warning: 'is_numeric_type' is deprecated
      [-Wdeprecated-declarations]
                || ! args(i).is_numeric_type ()
                             ^
/Applications/Octave-4.4.0.app/Contents/Resources/usr/Cellar/octave-octave-app_4.4.0/4.4.0/include/octave-4.4.0/octave/ov.h:726:3: note:
      'is_numeric_type' has been explicitly marked deprecated here
  OCTAVE_DEPRECATED (4.4, "use 'isnumeric' instead")
  ^
/Applications/Octave-4.4.0.app/Contents/Resources/usr/Cellar/octave-octave-app_4.4.0/4.4.0/include/octave-4.4.0/octave/octave-config.h:73:59: note:
      expanded from macro 'OCTAVE_DEPRECATED'
#      define OCTAVE_DEPRECATED(ver, msg) __attribute__ ((__deprecat...
                                                          ^
In file included from __control_helper_functions__.cc:6:
./is_zp_vector.cc:54:31: warning: 'is_complex_type' is deprecated
      [-Wdeprecated-declarations]
                || ! (args(i).is_complex_type () || args(i).i...
                              ^
/Applications/Octave-4.4.0.app/Contents/Resources/usr/Cellar/octave-octave-app_4.4.0/4.4.0/include/octave-4.4.0/octave/ov.h:713:3: note:
      'is_complex_type' has been explicitly marked deprecated here
  OCTAVE_DEPRECATED (4.4, "use 'iscomplex' instead")
  ^
/Applications/Octave-4.4.0.app/Contents/Resources/usr/Cellar/octave-octave-app_4.4.0/4.4.0/include/octave-4.4.0/octave/octave-config.h:73:59: note:
      expanded from macro 'OCTAVE_DEPRECATED'
#      define OCTAVE_DEPRECATED(ver, msg) __attribute__ ((__deprecat...
                                                          ^
In file included from __control_helper_functions__.cc:6:
./is_zp_vector.cc:54:61: warning: 'is_real_type' is deprecated
      [-Wdeprecated-declarations]
  ...|| ! (args(i).is_complex_type () || args(i).is_real_type ())
                                                 ^
/Applications/Octave-4.4.0.app/Contents/Resources/usr/Cellar/octave-octave-app_4.4.0/4.4.0/include/octave-4.4.0/octave/ov.h:706:3: note:
      'is_real_type' has been explicitly marked deprecated here
  OCTAVE_DEPRECATED (4.4, "use 'isreal' instead")
  ^
/Applications/Octave-4.4.0.app/Contents/Resources/usr/Cellar/octave-octave-app_4.4.0/4.4.0/include/octave-4.4.0/octave/octave-config.h:73:59: note:
      expanded from macro 'OCTAVE_DEPRECATED'
#      define OCTAVE_DEPRECATED(ver, msg) __attribute__ ((__deprecat...
                                                          ^
In file included from __control_helper_functions__.cc:7:
./lti_input_idx.cc:63:55: warning: 'is_cell' is deprecated
      [-Wdeprecated-declarations]
  if (nargin == 1 && args(0).is_defined () && args(0).is_cell ())
                                                      ^
/Applications/Octave-4.4.0.app/Contents/Resources/usr/Cellar/octave-octave-app_4.4.0/4.4.0/include/octave-4.4.0/octave/ov.h:539:3: note:
      'is_cell' has been explicitly marked deprecated here
  OCTAVE_DEPRECATED (4.4, "use 'iscell' instead")
  ^
/Applications/Octave-4.4.0.app/Contents/Resources/usr/Cellar/octave-octave-app_4.4.0/4.4.0/include/octave-4.4.0/octave/octave-config.h:73:59: note:
      expanded from macro 'OCTAVE_DEPRECATED'
#      define OCTAVE_DEPRECATED(ver, msg) __attribute__ ((__deprecat...
                                                          ^
In file included from __control_helper_functions__.cc:7:
./lti_input_idx.cc:90:45: warning: 'is_object' is deprecated
      [-Wdeprecated-declarations]
        && args(0).cell_value().elem(idx-1).is_object ())
                                            ^
/Applications/Octave-4.4.0.app/Contents/Resources/usr/Cellar/octave-octave-app_4.4.0/4.4.0/include/octave-4.4.0/octave/ov.h:611:3: note:
      'is_object' has been explicitly marked deprecated here
  OCTAVE_DEPRECATED (4.4, "use 'isobject' instead")
  ^
/Applications/Octave-4.4.0.app/Contents/Resources/usr/Cellar/octave-octave-app_4.4.0/4.4.0/include/octave-4.4.0/octave/octave-config.h:73:59: note:
      expanded from macro 'OCTAVE_DEPRECATED'
#      define OCTAVE_DEPRECATED(ver, msg) __attribute__ ((__deprecat...
                                                          ^
In file included from __control_helper_functions__.cc:9:
./nfields2.cc:15:30: warning: 'is_map' is deprecated
      [-Wdeprecated-declarations]
  if (nargin == 1 && args(0).is_map ())
                             ^
/Applications/Octave-4.4.0.app/Contents/Resources/usr/Cellar/octave-octave-app_4.4.0/4.4.0/include/octave-4.4.0/octave/ov.h:592:3: note:
      'is_map' has been explicitly marked deprecated here
  OCTAVE_DEPRECATED (4.4, "use 'isstruct' instead")
  ^
/Applications/Octave-4.4.0.app/Contents/Resources/usr/Cellar/octave-octave-app_4.4.0/4.4.0/include/octave-4.4.0/octave/octave-config.h:73:59: note:
      expanded from macro 'OCTAVE_DEPRECATED'
#      define OCTAVE_DEPRECATED(ver, msg) __attribute__ ((__deprecat...
                                                          ^
17 warnings generated.
tar -xzf slicot.tar.gz
/Applications/Octave-4.4.0.app/Contents/Resources/usr/Cellar/octave-octave-app_4.4.0/4.4.0/bin/mkoctfile-4.4.0 __control_helper_functions__.cc
mkdir sltmp
mv slicot/src/*.f ./sltmp
mv slicot/src_aux/*.f ./sltmp
cp TG04BX.fortran ./sltmp/TG04BX.f
cp TB01ZD.fortran ./sltmp/TB01ZD.f
cd sltmp; /Applications/Octave-4.4.0.app/Contents/Resources/usr/Cellar/octave-octave-app_4.4.0/4.4.0/bin/mkoctfile-4.4.0 -c *.f

pkg: error running `make' for the control package.
error: called from
    configure_make at line 95 column 9
    install at line 184 column 7
    pkg at line 437 column 9 “


Thank you

Mohammed

---------------------------------------
Mohammed Elmusrati, Full Professor
Head of Communications and Systems Eng. Group
Faculty of Technology
University of Vaasa
Visiting Professor at Aalto University
Phone: +358 50 4003763
Website: www.uwasa.fi/~moel



> On 2 Jul 2018, at 00:11, Sebastian Schöps <[hidden email]> wrote:
>
> elmusrati wrote
>> “pkg: error running `make' for the control package.
>> error: called from
>>    configure_make at line 95 column 9
>>    install at line 184 column 7
>>    pkg at line 437 column 9”
>
> I just tried to install the control package and it worked fine (Octave.app
> beta3, macOS 10.13.5). You can check where make breaks by 'pkg install
> -verbose -forge control' and report here what causes the problem.
>
>
> elmusrati wrote
>> I have installed octave4.4 also using brew (over terminal). Do I need to
>> remove it?
>
> No, that should be independent.
>
>
>
> --
> Sent from: http://octave.1599824.n4.nabble.com/Octave-Maintainers-f1638794.html
>


Reply | Threaded
Open this post in threaded view
|

Re: macOS 4.4.0 DMG (beta2) ready for testing

sshah
In reply to this post by AndrewJanke
Hi Andrew,

Can the App be installed for testing without interference with octave 4.4.0
(cli) installed using Homebrew?  

Assuming yes, can it be invoked from a terminal window or a shell in cli
mode?  

Thanks!







--
Sent from: http://octave.1599824.n4.nabble.com/Octave-Maintainers-f1638794.html

Reply | Threaded
Open this post in threaded view
|

Re: macOS 4.4.0 DMG (beta2) ready for testing

sshah
I see the same problem with installed packages i.e. silent crashes.
Reinstallation of control package from forge gives

pkg: error running `make' for the control package.
error: called from
    configure_make at line 95 column 9
    install at line 184 column 7
    pkg at line 437 column 9



Otherwise, I have not found problems yet.





--
Sent from: http://octave.1599824.n4.nabble.com/Octave-Maintainers-f1638794.html

Reply | Threaded
Open this post in threaded view
|

Re: macOS 4.4.0 DMG (beta2) ready for testing

Sebastian Schöps
sshah wrote
> I see the same problem with installed packages i.e. silent crashes.
> Reinstallation of control package from forge gives

Please help us debugging. For which packages did it occur? Can you explain
how to reproduce this? Did you reinstall these packages?


sshah wrote
> pkg: error running `make' for the control package.
> error: called from
>     configure_make at line 95 column 9
>     install at line 184 column 7
>     pkg at line 437 column 9

It does work for me. You may have a broken Fortran compiler somewhere!? Can
you try putting "setenv('F77',
'/Applications/Octave-4.4.0.app/Contents/Resources/usr/bin/gfortran')"
before installing the package?

....and please move the discussion here:
https://github.com/octave-app/octave-app-bundler/issues/37

Seb.



--
Sent from: http://octave.1599824.n4.nabble.com/Octave-Maintainers-f1638794.html

Reply | Threaded
Open this post in threaded view
|

Re: macOS 4.4.0 DMG (beta2) ready for testing

sshah
I am on mac os 10.13.6.

I have the octave version 4.4.0_2 installed using homebrew.   It has
control, signal, parallel, struct, quaternion packages installed.  They get
loaded in .octaverc

For the App, after uninstalling all packages, I can install struct, parallel
and quaternion.  They run fine.

I set F77 using setenv command.

 --------------------
>> setenv('F77','/Applications/Octave-4.4.0.app/Contents/Resources/usr/bin/gfortran')
>> pkg install -forge control
In file included from __control_helper_functions__.cc:1:
./is_real_scalar.cc:52:30: warning: 'is_numeric_type' is deprecated
[-Wdeprecated-declarations]
                || ! args(i).is_numeric_type () || ! args(i).is_real_type ()
                             ^
/Applications/Octave-4.4.0.app/Contents/Resources/usr/Cellar/octave-octave-app_4.4.0/4.4.0/include/octave-4.4.0/octave/ov.h:726:3:
note:
      'is_numeric_type' has been explicitly marked deprecated here
  OCTAVE_DEPRECATED (4.4, "use 'isnumeric' instead")
  ^
/Applications/Octave-4.4.0.app/Contents/Resources/usr/Cellar/octave-octave-app_4.4.0/4.4.0/include/octave-4.4.0/octave/octave-config.h:73:59:
note:
      expanded from macro 'OCTAVE_DEPRECATED'
#      define OCTAVE_DEPRECATED(ver, msg) __attribute__ ((__deprecated__))
                                                          ^
In file included from __control_helper_functions__.cc:1:
./is_real_scalar.cc:52:62: warning: 'is_real_type' is deprecated
[-Wdeprecated-declarations]
                || ! args(i).is_numeric_type () || ! args(i).is_real_type ()
                                                             ^
/Applications/Octave-4.4.0.app/Contents/Resources/usr/Cellar/octave-octave-app_4.4.0/4.4.0/include/octave-4.4.0/octave/ov.h:706:3:
note:
      'is_real_type' has been explicitly marked deprecated here
  OCTAVE_DEPRECATED (4.4, "use 'isreal' instead")
  ^
/Applications/Octave-4.4.0.app/Contents/Resources/usr/Cellar/octave-octave-app_4.4.0/4.4.0/include/octave-4.4.0/octave/octave-config.h:73:59:
note:
      expanded from macro 'OCTAVE_DEPRECATED'
#      define OCTAVE_DEPRECATED(ver, msg) __attribute__ ((__deprecated__))
                                                          ^
In file included from __control_helper_functions__.cc:2:
./is_real_vector.cc:52:30: warning: 'is_numeric_type' is deprecated
[-Wdeprecated-declarations]
                || ! args(i).is_numeric_type () || ! args(i).is_real_type ()
                             ^
/Applications/Octave-4.4.0.app/Contents/Resources/usr/Cellar/octave-octave-app_4.4.0/4.4.0/include/octave-4.4.0/octave/ov.h:726:3:
note:
      'is_numeric_type' has been explicitly marked deprecated here
  OCTAVE_DEPRECATED (4.4, "use 'isnumeric' instead")
  ^
/Applications/Octave-4.4.0.app/Contents/Resources/usr/Cellar/octave-octave-app_4.4.0/4.4.0/include/octave-4.4.0/octave/octave-config.h:73:59:
note:
      expanded from macro 'OCTAVE_DEPRECATED'
#      define OCTAVE_DEPRECATED(ver, msg) __attribute__ ((__deprecated__))
                                                          ^
In file included from __control_helper_functions__.cc:2:
./is_real_vector.cc:52:62: warning: 'is_real_type' is deprecated
[-Wdeprecated-declarations]
                || ! args(i).is_numeric_type () || ! args(i).is_real_type ()
                                                             ^
/Applications/Octave-4.4.0.app/Contents/Resources/usr/Cellar/octave-octave-app_4.4.0/4.4.0/include/octave-4.4.0/octave/ov.h:706:3:
note:
      'is_real_type' has been explicitly marked deprecated here
  OCTAVE_DEPRECATED (4.4, "use 'isreal' instead")
  ^
/Applications/Octave-4.4.0.app/Contents/Resources/usr/Cellar/octave-octave-app_4.4.0/4.4.0/include/octave-4.4.0/octave/octave-config.h:73:59:
note:
      expanded from macro 'OCTAVE_DEPRECATED'
#      define OCTAVE_DEPRECATED(ver, msg) __attribute__ ((__deprecated__))
                                                          ^
In file included from __control_helper_functions__.cc:3:
./is_real_matrix.cc:51:52: warning: 'is_numeric_type' is deprecated
[-Wdeprecated-declarations]
            if (args(i).ndims () != 2 || ! args(i).is_numeric_type ()
                                                   ^
/Applications/Octave-4.4.0.app/Contents/Resources/usr/Cellar/octave-octave-app_4.4.0/4.4.0/include/octave-4.4.0/octave/ov.h:726:3:
note:
      'is_numeric_type' has been explicitly marked deprecated here
  OCTAVE_DEPRECATED (4.4, "use 'isnumeric' instead")
  ^
/Applications/Octave-4.4.0.app/Contents/Resources/usr/Cellar/octave-octave-app_4.4.0/4.4.0/include/octave-4.4.0/octave/octave-config.h:73:59:
note:
      expanded from macro 'OCTAVE_DEPRECATED'
#      define OCTAVE_DEPRECATED(ver, msg) __attribute__ ((__deprecated__))
                                                          ^
In file included from __control_helper_functions__.cc:3:
./is_real_matrix.cc:52:30: warning: 'is_real_type' is deprecated
[-Wdeprecated-declarations]
                || ! args(i).is_real_type ()
                             ^
/Applications/Octave-4.4.0.app/Contents/Resources/usr/Cellar/octave-octave-app_4.4.0/4.4.0/include/octave-4.4.0/octave/ov.h:706:3:
note:
      'is_real_type' has been explicitly marked deprecated here
  OCTAVE_DEPRECATED (4.4, "use 'isreal' instead")
  ^
/Applications/Octave-4.4.0.app/Contents/Resources/usr/Cellar/octave-octave-app_4.4.0/4.4.0/include/octave-4.4.0/octave/octave-config.h:73:59:
note:
      expanded from macro 'OCTAVE_DEPRECATED'
#      define OCTAVE_DEPRECATED(ver, msg) __attribute__ ((__deprecated__))
                                                          ^
In file included from __control_helper_functions__.cc:4:
./is_real_square_matrix.cc:52:30: warning: 'is_numeric_type' is deprecated
[-Wdeprecated-declarations]
                || ! args(i).is_numeric_type () || ! args(i).is_real_type ()
                             ^
/Applications/Octave-4.4.0.app/Contents/Resources/usr/Cellar/octave-octave-app_4.4.0/4.4.0/include/octave-4.4.0/octave/ov.h:726:3:
note:
      'is_numeric_type' has been explicitly marked deprecated here
  OCTAVE_DEPRECATED (4.4, "use 'isnumeric' instead")
  ^
/Applications/Octave-4.4.0.app/Contents/Resources/usr/Cellar/octave-octave-app_4.4.0/4.4.0/include/octave-4.4.0/octave/octave-config.h:73:59:
note:
      expanded from macro 'OCTAVE_DEPRECATED'
#      define OCTAVE_DEPRECATED(ver, msg) __attribute__ ((__deprecated__))
                                                          ^
In file included from __control_helper_functions__.cc:4:
./is_real_square_matrix.cc:52:62: warning: 'is_real_type' is deprecated
[-Wdeprecated-declarations]
                || ! args(i).is_numeric_type () || ! args(i).is_real_type ()
                                                             ^
/Applications/Octave-4.4.0.app/Contents/Resources/usr/Cellar/octave-octave-app_4.4.0/4.4.0/include/octave-4.4.0/octave/ov.h:706:3:
note:
      'is_real_type' has been explicitly marked deprecated here
  OCTAVE_DEPRECATED (4.4, "use 'isreal' instead")
  ^
/Applications/Octave-4.4.0.app/Contents/Resources/usr/Cellar/octave-octave-app_4.4.0/4.4.0/include/octave-4.4.0/octave/octave-config.h:73:59:
note:
      expanded from macro 'OCTAVE_DEPRECATED'
#      define OCTAVE_DEPRECATED(ver, msg) __attribute__ ((__deprecated__))
                                                          ^
In file included from __control_helper_functions__.cc:5:
./is_matrix.cc:51:52: warning: 'is_numeric_type' is deprecated
[-Wdeprecated-declarations]
            if (args(i).ndims () != 2 || ! args(i).is_numeric_type ()
                                                   ^
/Applications/Octave-4.4.0.app/Contents/Resources/usr/Cellar/octave-octave-app_4.4.0/4.4.0/include/octave-4.4.0/octave/ov.h<built-in>:
internal compiler error: Illegal instruction: 4
:726:3: note:
      'is_numeric_type' has been explicitly marked deprecated here
  OCTAVE_DEPRECATED (4.4, "use 'isnumeric' instead")
  ^
/Applications/Octave-4.4.0.app/Contents/Resources/usr/Cellar/octave-octave-app_4.4.0/4.4.0/include/octave-4.4.0/octave/octave-config.h:73:59:
note:
      expanded from macro 'OCTAVE_DEPRECATED'
#      define OCTAVE_DEPRECATED(ver, msg) __attribute__ ((__deprecated__))
                                                          ^
In file included from __control_helper_functions__.cc:5:
./is_matrix.cc:52:31: warning: 'is_complex_type' is deprecated
[-Wdeprecated-declarations]
                || ! (args(i).is_complex_type () || args(i).is_real_type ())
                              ^
/Applications/Octave-4.4.0.app/Contents/Resources/usr/Cellar/octave-octave-app_4.4.0/4.4.0/include/octave-4.4.0/octave/ov.h:713:3:
note:
      'is_complex_type' has been explicitly marked deprecated here
  OCTAVE_DEPRECATED (4.4, "use 'iscomplex' instead")
  ^
/Applications/Octave-4.4.0.app/Contents/Resources/usr/Cellar/octave-octave-app_4.4.0/4.4.0/include/octave-4.4.0/octave/octave-config.h:73:59:
note:
      expanded from macro 'OCTAVE_DEPRECATED'
#      define OCTAVE_DEPRECATED(ver, msg) __attribute__ ((__deprecated__))
                                                          ^
In file included from __control_helper_functions__.cc:5:
./is_matrix.cc:52:61: warning: 'is_real_type' is deprecated
[-Wdeprecated-declarations]
                || ! (args(i).is_complex_type () || args(i).is_real_type ())
                                                            ^
libbacktrace could not find executable to open
/Applications/Octave-4.4.0.app/Contents/Resources/usr/Cellar/octave-octave-app_4.4.0/4.4.0/include/octave-4.4.0/octave/ov.h:706:3:
note:
      'is_real_type' has been explicitly marked deprecated here
  OCTAVE_DEPRECATED (4.4, "use 'isreal' instead")
  ^
/Applications/Octave-4.4.0.app/Contents/Resources/usr/Cellar/octave-octave-app_4.4.0/4.4.0/include/octave-4.4.0/octave/octave-config.h:73:59:
note:
      expanded from macro 'OCTAVE_DEPRECATED'
#      define OCTAVE_DEPRECATED(ver, msg) __attribute__ ((__deprecated__))
                                                          ^
In file included from __control_helper_functions__.cc:6:
./is_zp_vector.cc:53:30: warning: 'is_numeric_type' is deprecated
[-Wdeprecated-declarations]
                || ! args(i).is_numeric_type ()
                             ^
/Applications/Octave-4.4.0.app/Contents/Resources/usr/Cellar/octave-octave-app_4.4.0/4.4.0/include/octave-4.4.0/octave/ov.hPlease
submit a full bug report,
with preprocessed source if appropriate.
:726:3: See <https://github.com/Homebrew/homebrew-core/issues> for
instructions.
note:
      'is_numeric_type' has been explicitly marked deprecated here
  OCTAVE_DEPRECATED (4.4, "use 'isnumeric' instead")
  ^
/Applications/Octave-4.4.0.app/Contents/Resources/usr/Cellar/octave-octave-app_4.4.0/4.4.0/include/octave-4.4.0/octave/octave-config.h:73:59:
note:
      expanded from macro 'OCTAVE_DEPRECATED'
#      define OCTAVE_DEPRECATED(ver, msg) __attribute__ ((__deprecated__))
                                                          ^
In file included from __control_helper_functions__.cc:6:
./is_zp_vector.cc:54:31: warning: 'is_complex_type' is deprecated
[-Wdeprecated-declarations]
                || ! (args(i).is_complex_type () || args(i).is_real_type
())make:
*** [slicotlibrary.a] Error 1                              ^

/Applications/Octave-4.4.0.app/Contents/Resources/usr/Cellar/octave-octave-app_4.4.0/4.4.0/include/octave-4.4.0/octave/ov.h:713:3:
make: *** Waiting for unfinished jobs....note
:
      'is_complex_type' has been explicitly marked deprecated here
  OCTAVE_DEPRECATED (4.4, "use 'iscomplex' instead")
  ^
/Applications/Octave-4.4.0.app/Contents/Resources/usr/Cellar/octave-octave-app_4.4.0/4.4.0/include/octave-4.4.0/octave/octave-config.h:73:59:
note:
      expanded from macro 'OCTAVE_DEPRECATED'
#      define OCTAVE_DEPRECATED(ver, msg) __attribute__ ((__deprecated__))
                                                          ^
In file included from __control_helper_functions__.cc:6:
./is_zp_vector.cc:54:61: warning: 'is_real_type' is deprecated
[-Wdeprecated-declarations]
                || ! (args(i).is_complex_type () || args(i).is_real_type ())
                                                            ^
/Applications/Octave-4.4.0.app/Contents/Resources/usr/Cellar/octave-octave-app_4.4.0/4.4.0/include/octave-4.4.0/octave/ov.h:706:3:
note:
      'is_real_type' has been explicitly marked deprecated here
  OCTAVE_DEPRECATED (4.4, "use 'isreal' instead")
  ^
/Applications/Octave-4.4.0.app/Contents/Resources/usr/Cellar/octave-octave-app_4.4.0/4.4.0/include/octave-4.4.0/octave/octave-config.h:73:59:
note:
      expanded from macro 'OCTAVE_DEPRECATED'
#      define OCTAVE_DEPRECATED(ver, msg) __attribute__ ((__deprecated__))
                                                          ^
In file included from __control_helper_functions__.cc:7:
./lti_input_idx.cc:63:55: warning: 'is_cell' is deprecated
[-Wdeprecated-declarations]
  if (nargin == 1 && args(0).is_defined () && args(0).is_cell ())
                                                      ^
/Applications/Octave-4.4.0.app/Contents/Resources/usr/Cellar/octave-octave-app_4.4.0/4.4.0/include/octave-4.4.0/octave/ov.h:539:3:
note:
      'is_cell' has been explicitly marked deprecated here
  OCTAVE_DEPRECATED (4.4, "use 'iscell' instead")
  ^
/Applications/Octave-4.4.0.app/Contents/Resources/usr/Cellar/octave-octave-app_4.4.0/4.4.0/include/octave-4.4.0/octave/octave-config.h:73:59:
note:
      expanded from macro 'OCTAVE_DEPRECATED'
#      define OCTAVE_DEPRECATED(ver, msg) __attribute__ ((__deprecated__))
                                                          ^
In file included from __control_helper_functions__.cc:7:
./lti_input_idx.cc:90:45: warning: 'is_object' is deprecated
[-Wdeprecated-declarations]
        && args(0).cell_value().elem(idx-1).is_object ())
                                            ^
/Applications/Octave-4.4.0.app/Contents/Resources/usr/Cellar/octave-octave-app_4.4.0/4.4.0/include/octave-4.4.0/octave/ov.h:611:3:
note:
      'is_object' has been explicitly marked deprecated here
  OCTAVE_DEPRECATED (4.4, "use 'isobject' instead")
  ^
/Applications/Octave-4.4.0.app/Contents/Resources/usr/Cellar/octave-octave-app_4.4.0/4.4.0/include/octave-4.4.0/octave/octave-config.h:73:59:
note:
      expanded from macro 'OCTAVE_DEPRECATED'
#      define OCTAVE_DEPRECATED(ver, msg) __attribute__ ((__deprecated__))
                                                          ^
In file included from __control_helper_functions__.cc:9:
./nfields2.cc:15:30: warning: 'is_map' is deprecated
[-Wdeprecated-declarations]
  if (nargin == 1 && args(0).is_map ())
                             ^
/Applications/Octave-4.4.0.app/Contents/Resources/usr/Cellar/octave-octave-app_4.4.0/4.4.0/include/octave-4.4.0/octave/ov.h:592:3:
note:
      'is_map' has been explicitly marked deprecated here
  OCTAVE_DEPRECATED (4.4, "use 'isstruct' instead")
  ^
/Applications/Octave-4.4.0.app/Contents/Resources/usr/Cellar/octave-octave-app_4.4.0/4.4.0/include/octave-4.4.0/octave/octave-config.h:73:59:
note:
      expanded from macro 'OCTAVE_DEPRECATED'
#      define OCTAVE_DEPRECATED(ver, msg) __attribute__ ((__deprecated__))
                                                          ^
17 warnings generated.
tar -xzf slicot.tar.gz
/Applications/Octave-4.4.0.app/Contents/Resources/usr/Cellar/octave-octave-app_4.4.0/4.4.0/bin/mkoctfile-4.4.0
__control_helper_functions__.cc
mkdir sltmp
mv slicot/src/*.f ./sltmp
mv slicot/src_aux/*.f ./sltmp
cp TG04BX.fortran ./sltmp/TG04BX.f
cp TB01ZD.fortran ./sltmp/TB01ZD.f
cd sltmp;
/Applications/Octave-4.4.0.app/Contents/Resources/usr/Cellar/octave-octave-app_4.4.0/4.4.0/bin/mkoctfile-4.4.0
-c *.f

pkg: error running `make' for the control package.
error: called from
    configure_make at line 95 column 9
    install at line 184 column 7
    pkg at line 437 column 9


--------------------

Hope that helps.









--
Sent from: http://octave.1599824.n4.nabble.com/Octave-Maintainers-f1638794.html

Reply | Threaded
Open this post in threaded view
|

Re: macOS 4.4.0 DMG (beta2) ready for testing

Sebastian Schöps
sshah wrote

> I am on mac os 10.13.6.
>
> I have the octave version 4.4.0_2 installed using homebrew.   It has
> control, signal, parallel, struct, quaternion packages installed.  They
> get
> loaded in .octaverc
>
> For the App, after uninstalling all packages, I can install struct,
> parallel
> and quaternion.  They run fine.
>
> I set F77 using setenv command.
> [...]
> pkg: error running `make' for the control package.
> error: called from
>     configure_make at line 95 column 9
>     install at line 184 column 7
>     pkg at line 437 column 9

I am running out of ideas... I was hoping that there is a mismatch with the
compilers but I am not sure anymore. Was there any difference with setting
F77 or without? Could you test the bundle without having octave installed
from homebrew? (I am having both as well and it works...) or can you try to
set setenv('cc','/usr/bin/clang') and setenv('cxx','/usr/bin/clang++'), just
to make sure?

Seb.





--
Sent from: http://octave.1599824.n4.nabble.com/Octave-Maintainers-f1638794.html

Reply | Threaded
Open this post in threaded view
|

Re: macOS 4.4.0 DMG (beta2) ready for testing

sshah
compilers are invoked correctly during pkg install as far as I can tell from
watching Activity monitor.  

What could cause error:

/Applications/Octave-4.4.0.app/Contents/Resources/usr/Cellar/octave-octave-app_4.4.0/4.4.0/include/octave-4.4.0/octave/ov.h<built-in>:
internal compiler error: Illegal instruction: 4
:726:3: note:
      'is_numeric_type' has been explicitly marked deprecated here
  OCTAVE_DEPRECATED (4.4, "use 'isnumeric' instead")

I have not tried uninstall homebrew octave and testing yet.  Will do and let
you know.



--
Sent from: http://octave.1599824.n4.nabble.com/Octave-Maintainers-f1638794.html

Reply | Threaded
Open this post in threaded view
|

Re: macOS 4.4.0 DMG (beta2) ready for testing

sshah
Uninstalling homebrew octave and setting the compiler variables did not help.

I still get

> setenv('cc','/usr/bin/clang')
>> setenv('cxx','/usr/bin/clang++')
>> setenv('F77','/Applications/Octave-4.4.0.app/Contents/Resources/usr/bin/gfortran')
>> pkg install -forge control
<built-in>: internal compiler error: Illegal instruction: 4
libbacktrace could not find executable to open
Please submit a full bug report,
with preprocessed source if appropriate.
See <https://github.com/Homebrew/homebrew-core/issues> for instructions.
make: *** [slicotlibrary.a] Error 1

... (warnings)

17 warnings generated.
tar -xzf slicot.tar.gz
/Applications/Octave-4.4.0.app/Contents/Resources/usr/Cellar/octave-octave-app_4.4.0/4.4.0/bin/mkoctfile-4.4.0
__control_helper_functions__.cc
mkdir sltmp
mv slicot/src/*.f ./sltmp
mv slicot/src_aux/*.f ./sltmp
cp TG04BX.fortran ./sltmp/TG04BX.f
cp TB01ZD.fortran ./sltmp/TB01ZD.f
cd sltmp;
/Applications/Octave-4.4.0.app/Contents/Resources/usr/Cellar/octave-octave-app_4.4.0/4.4.0/bin/mkoctfile-4.4.0
-c *.f

pkg: error running `make' for the control package.
error: called from
    configure_make at line 95 column 9
    install at line 184 column 7
    pkg at line 437 column 9



--
Sent from: http://octave.1599824.n4.nabble.com/Octave-Maintainers-f1638794.html