pkg: error running `make' for the tisean package

classic Classic list List threaded Threaded
6 messages Options
Reply | Threaded
Open this post in threaded view
|

pkg: error running `make' for the tisean package

tsaw
Hi,

I'm relatively new in octave (running in windows). I want to install the
tisean package and get the following  errors:


collect2.exe: error: ld returned 1 exit status
make: *** [Makefile:76: __surrogates__.oct] Error 1
make: Entering directory
'/c/Users/nemo/AppData/Local/Temp/oct-RbUUpG/tisean-0.2.3/src'
cd source_f/slatec && make
.
.
.
pkg: error running `make' for the tisean package.
error: called from
    configure_make at line 99 column 9
    install at line 184 column 7
    pkg at line 441 column 9


I have tried installing it online and by downloading the package to my hdd
and get the same errors.
Any help is welcome!

Thank you





--
Sent from: http://octave.1599824.n4.nabble.com/Octave-General-f1599825.html


Reply | Threaded
Open this post in threaded view
|

Re: pkg: error running `make' for the tisean package

tsaw
I forgot.... octave version is 5.1 and tisean 2.3
thank you



--
Sent from: http://octave.1599824.n4.nabble.com/Octave-General-f1599825.html


Reply | Threaded
Open this post in threaded view
|

Re: pkg: error running `make' for the tisean package

John Donoghue-3
In reply to this post by tsaw
On 6/8/19 10:05 AM, [hidden email] wrote:

> Message: 8
> Date: Sat, 8 Jun 2019 09:04:55 -0500 (CDT)
> From: tsaw<[hidden email]>
> To:[hidden email]
> Subject: Re: pkg: error running `make' for the tisean package
> Message-ID:<[hidden email]>
> Content-Type: text/plain; charset=us-ascii
>
> I forgot.... octave version is 5.1 and tisean 2.3
> thank you
>
>
Is there any reason you are trying to install it when it should already
be installed in the windows octave installation?

If no packages are showing when you run 'pkg list', then run


pkg rebuild


and then


pkg list



Reply | Threaded
Open this post in threaded view
|

Re: pkg: error running `make' for the tisean package

tsaw
Thank you for your soon answer. I didn't mention but although it was
installed as you say, it was not able to load so I decided to reinstall it.

I couldn't fix it yet, any other suggestions?

thanks



--
Sent from: http://octave.1599824.n4.nabble.com/Octave-General-f1599825.html


Reply | Threaded
Open this post in threaded view
|

RE: Re: pkg: error running `make' for the tisean package

John Donoghue-3
In reply to this post by tsaw
> Message: 1
> Date: Tue, 11 Jun 2019 09:54:01 -0500 (CDT)
> From: tsaw <[hidden email]>
> To: [hidden email]
> Subject: Re: pkg: error running `make' for the tisean package
> Message-ID: <[hidden email]>
> Content-Type: text/plain; charset=us-ascii
>
> Thank you for your soon answer. I didn't mention but although it was
> installed as you say, it was not able to load so I decided to reinstall it.
>
> I couldn't fix it yet, any other suggestions?
>
> thanks
>
>
>
> --
> Sent from: http://octave.1599824.n4.nabble.com/Octave-General-
> f1599825.html
>
>
>


Did it have any error displayed when trying to load it?

There is a patch to get it to build in windows, reported here [1] and is efefctivly what is used for the package in the windows installer.

To use it, you would need to untar the package, apply the patch, tar it back up and then install using the modified tarball. Its far easier to use the preinstalled package if possible.

[1] https://savannah.gnu.org/bugs/?45815




Reply | Threaded
Open this post in threaded view
|

RE: Re: pkg: error running `make' for the tisean package

tsaw
I couldn't fix it this way. So I reinstalled Octave and now it works fine!
thank you



--
Sent from: http://octave.1599824.n4.nabble.com/Octave-General-f1599825.html